Reaction Details
TargetSphingosine-1-phosphate lyase 1
LigandBDBM313219
Substrate/Competitorn/a
Meas. Tech.S1P1 Binding Assay
IC50<10±n/a nM
Citation Dyckman, AJDhar, TGXiao, HGilmore, JLYang, MGXiao, ZMarcoux, D Substituted bicyclic compounds US Patent US10166249 Publication Date 1/1/2019
 
Sphingosine-1-phosphate lyase 1
Name:Sphingosine-1-phosphate lyase 1
Type:PROTEIN
Mol. Mass.:63546.76
Organism:Homo sapiens (Human)
Description:ChEMBL_108363
Residue:568
BDBM313219
NameBDBM313219
Synonyms:US10166249, Example 449
TypeSmall organic molecule
Emp. Form.C23H29FNO5P
Mol. Mass.449.4522
SMILESN[C@]1(COP(O)(O)=O)CC[C@@H](C1)c1ccc2CC(COc3ccc(F)cc3)CCc2c1