Reaction Details
TargetSphingosine-1-phosphate lyase 1
LigandBDBM65093
Substrate/Competitorn/a
Meas. Tech.S1P1 Binding Assay
IC50<10±n/a nM
Citation Dyckman, AJDhar, TGXiao, HGilmore, JLYang, MGXiao, ZMarcoux, D Substituted bicyclic compounds US Patent US10166249 Publication Date 1/1/2019
 
Sphingosine-1-phosphate lyase 1
Name:Sphingosine-1-phosphate lyase 1
Type:PROTEIN
Mol. Mass.:63546.76
Organism:Homo sapiens (Human)
Description:ChEMBL_108363
Residue:568
BDBM65093
NameBDBM65093
Synonyms:US10166249, Example 459 | US9522888, 459
Typen/a
Emp. Form.C23H30NO5P
Mol. Mass.431.4618
SMILESN[C@]1(COP(O)(O)=O)CC[C@@H](C1)c1ccc2C[C@@H](COc3ccccc3)CCc2c1