Reaction Details
TargetSphingosine-1-phosphate lyase 1
LigandBDBM65237
Substrate/Competitorn/a
Meas. Tech.S1P1 Binding Assay
IC50<10±n/a nM
Citation Dyckman, AJDhar, TGXiao, HGilmore, JLYang, MGXiao, ZMarcoux, D Substituted bicyclic compounds US Patent US10166249 Publication Date 1/1/2019
 
Sphingosine-1-phosphate lyase 1
Name:Sphingosine-1-phosphate lyase 1
Type:PROTEIN
Mol. Mass.:63546.76
Organism:Homo sapiens (Human)
Description:ChEMBL_108363
Residue:568
BDBM65237
NameBDBM65237
Synonyms:US10166249, Example 567 | US9522888, 567
Typen/a
Emp. Form.C24H32NO5P
Mol. Mass.445.4883
SMILESCOc1cccc(C[C@H]2CCc3cc(ccc3C2)[C@H]2CC[C@](N)(COP(O)(O)=O)C2)c1