Reaction Details
TargetSphingosine-1-phosphate lyase 1
LigandBDBM313354
Substrate/Competitorn/a
Meas. Tech.hS1P1 ERK Phosphorylation (S1P1 pERK)
EC50<10±n/a nM
Citation Dyckman, AJDhar, TGXiao, HGilmore, JLYang, MGXiao, ZMarcoux, D Substituted bicyclic compounds US Patent US10166249 Publication Date 1/1/2019
 
Sphingosine-1-phosphate lyase 1
Name:Sphingosine-1-phosphate lyase 1
Type:PROTEIN
Mol. Mass.:63546.76
Organism:Homo sapiens (Human)
Description:ChEMBL_108363
Residue:568
BDBM313354
NameBDBM313354
Synonyms:US10166249, Example 589
TypeSmall organic molecule
Emp. Form.C23H32NO6PS
Mol. Mass.481.542
SMILESN[C@]1(COP(O)(O)=O)CC[C@@H](C1)c1ccc2C[C@@H](CCc2c1)OCCOCc1cccs1