Reaction Details
TargetSphingosine-1-phosphate lyase 1
LigandBDBM313359
Substrate/Competitorn/a
Meas. Tech.hS1P1 ERK Phosphorylation (S1P1 pERK)
EC50<10±n/a nM
Citation Dyckman, AJDhar, TGXiao, HGilmore, JLYang, MGXiao, ZMarcoux, D Substituted bicyclic compounds US Patent US10166249 Publication Date 1/1/2019
 
Sphingosine-1-phosphate lyase 1
Name:Sphingosine-1-phosphate lyase 1
Type:PROTEIN
Mol. Mass.:63546.76
Organism:Homo sapiens (Human)
Description:ChEMBL_108363
Residue:568
BDBM313359
NameBDBM313359
Synonyms:US10166249, Example 595
TypeSmall organic molecule
Emp. Form.C20H34NO5P
Mol. Mass.399.4614
SMILESCOCCCC1CCc2cc(ccc2C1)[C@H]1CC[C@](N)(COP(O)(O)O)C1