Reaction Details
TargetSphingosine-1-phosphate lyase 1
LigandBDBM65350
Substrate/Competitorn/a
Meas. Tech.S1P1 Binding Assay
IC50 55±n/a nM
Citation Dyckman, AJDhar, TGXiao, HGilmore, JLYang, MGXiao, ZMarcoux, D Substituted bicyclic compounds US Patent US10166249 Publication Date 1/1/2019
 
Sphingosine-1-phosphate lyase 1
Name:Sphingosine-1-phosphate lyase 1
Type:PROTEIN
Mol. Mass.:63546.76
Organism:Homo sapiens (Human)
Description:ChEMBL_108363
Residue:568
BDBM65350
NameBDBM65350
Synonyms:US10166249, Example 658 | US9522888, 658
Typen/a
Emp. Form.C22H34NO4P
Mol. Mass.407.4834
SMILESCC\C=C\CC[C@H]1CCc2cc(ccc2C1)[C@H]1CC[C@](N)(COP(O)(O)=O)C1