Reaction Details
TargetEpidermal growth factor receptor [T790M,L858R]
LigandBDBM149404
Substrate/Competitorn/a
Meas. Tech.EGFR in vitro assay
Kd 1.40±n/a nM
Citation Zhang, D Substituted pyrimidines useful as EGFR-T790M kinase inhibitors US Patent US10167264 Publication Date 1/1/2019
 
Epidermal growth factor receptor [T790M,L858R]
Name:Epidermal growth factor receptor [T790M,L858R]
Type:n/a
Mol. Mass.:134353.72
Organism:Homo sapiens (Human)
Description:P00533[T790M,L858R]
Residue:1210
BDBM149404
NameBDBM149404
Synonyms:AVL-301 CNX-419 Rociletinib US10167264, Compound CO-1686 US10434101, Compound I-4 US8975249, I-4 | US9783524, CO-1686
TypeSmall organic molecule
Emp. Form.C27H28F3N7O3
Mol. Mass.555.5515
SMILESCOc1cc(ccc1Nc1ncc(c(Nc2cccc(NC(=O)C=C)c2)n1)C(F)(F)F)N1CCN(CC1)C(C)=O