Reaction Details
TargetHeat shock protein HSP 90-alpha
LigandBDBM313762
Substrate/Competitorn/a
Meas. Tech.Biological Testing
EC50 77.2±1 nM
Citation Chiosis, GHe, HLlauger-Bufi, LKim, JLarson, SMSmith-Jones, P Small-molecule HSP90 inhibitors US Patent US10167285 Publication Date 1/1/2019
 
Heat shock protein HSP 90-alpha
Name:Heat shock protein HSP 90-alpha
Type:Molecular Chaperone
Mol. Mass.:84623.45
Organism:Homo sapiens (Human)
Description:P07900
Residue:732
BDBM313762
NameBDBM313762
Synonyms:US10167285, Example 7
TypeSmall organic molecule
Emp. Form.C17H14ClFN4O
Mol. Mass.344.771
SMILESFc1ncc2NC(Cc3c4Oc4ccc3Cl)N(CCCC#C)c2n1