Reaction Details
TargetHeat shock protein HSP 90-alpha
LigandBDBM313763
Substrate/Competitorn/a
Meas. Tech.Biological Testing
EC50 50.4±4 nM
Citation Chiosis, GHe, HLlauger-Bufi, LKim, JLarson, SMSmith-Jones, P Small-molecule HSP90 inhibitors US Patent US10167285 Publication Date 1/1/2019
 
Heat shock protein HSP 90-alpha
Name:Heat shock protein HSP 90-alpha
Type:Molecular Chaperone
Mol. Mass.:84623.45
Organism:Homo sapiens (Human)
Description:P07900
Residue:732
BDBM313763
NameBDBM313763
Synonyms:US10167285, Example 8
TypeSmall organic molecule
Emp. Form.C18H21FIN5O
Mol. Mass.469.2951
SMILESCC(C)NCCCN1C(Cc2c3Oc3ccc2I)Nc2cnc(F)nc12