Reaction Details
TargetHeat shock protein HSP 90-alpha
LigandBDBM313769
Substrate/Competitorn/a
Meas. Tech.Biological Testing
EC50 4600±20 nM
Citation Chiosis, GHe, HLlauger-Bufi, LKim, JLarson, SMSmith-Jones, P Small-molecule HSP90 inhibitors US Patent US10167285 Publication Date 1/1/2019
 
Heat shock protein HSP 90-alpha
Name:Heat shock protein HSP 90-alpha
Type:Molecular Chaperone
Mol. Mass.:84623.45
Organism:Homo sapiens (Human)
Description:P07900
Residue:732
BDBM313769
NameBDBM313769
Synonyms:US10167285, Example 14
TypeSmall organic molecule
Emp. Form.C19H20ClFN4O2
Mol. Mass.390.839
SMILESCOc1ccc(Cl)c(CC2Nc3cnc(F)nc3N2CCCC#C)c1OC