Reaction Details
TargetAldo-keto reductase family 1 member C3
LigandBDBM313873
Substrate/Competitorn/a
Meas. Tech.AKR1C3-Inhibitory Activity Assay
IC50 1.30±n/a nM
Citation Koppitz, MSiebeneicher, HSteuber, HTer Laak, ANubbemeyer, RRottmann, AIrlbacher, HBader, BPeters, MWagenfeld, ATerebesi, I [8-(phenylsulfonyl)-3,8-diazabicyclo[3.2.1]oct-3-yl](1H-1,2,3-triazol-4-yl)methanones US Patent US10167293 Publication Date 1/1/2019
 
Aldo-keto reductase family 1 member C3
Name:Aldo-keto reductase family 1 member C3
Type:Enzyme
Mol. Mass.:36859.86
Organism:Homo sapiens (Human)
Description:P42330
Residue:323
BDBM313873
NameBDBM313873
Synonyms:US10167293, Example 64
TypeSmall organic molecule
Emp. Form.C16H19N5O4S
Mol. Mass.377.418
SMILESCOc1ccccc1S(=O)(=O)N1C2CCC1CN(C2)C(=O)c1cnn[nH]1