Reaction Details
TargetAldo-keto reductase family 1 member C3
LigandBDBM313875
Substrate/Competitorn/a
Meas. Tech.AKR1C3-Inhibitory Activity Assay
IC50 0.900±n/a nM
Citation Koppitz, MSiebeneicher, HSteuber, HTer Laak, ANubbemeyer, RRottmann, AIrlbacher, HBader, BPeters, MWagenfeld, ATerebesi, I [8-(phenylsulfonyl)-3,8-diazabicyclo[3.2.1]oct-3-yl](1H-1,2,3-triazol-4-yl)methanones US Patent US10167293 Publication Date 1/1/2019
 
Aldo-keto reductase family 1 member C3
Name:Aldo-keto reductase family 1 member C3
Type:Enzyme
Mol. Mass.:36859.86
Organism:Homo sapiens (Human)
Description:P42330
Residue:323
BDBM313875
NameBDBM313875
Synonyms:US10167293, Example 66
TypeSmall organic molecule
Emp. Form.C16H17N5O5S
Mol. Mass.391.402
SMILESO=C(N1CC2CCC(C1)N2S(=O)(=O)c1ccc2OCOc2c1)c1cnn[nH]1