Reaction Details
TargetAldo-keto reductase family 1 member C3
LigandBDBM313878
Substrate/Competitorn/a
Meas. Tech.AKR1C3-Inhibitory Activity Assay
IC50 0.600±n/a nM
Citation Koppitz, MSiebeneicher, HSteuber, HTer Laak, ANubbemeyer, RRottmann, AIrlbacher, HBader, BPeters, MWagenfeld, ATerebesi, I [8-(phenylsulfonyl)-3,8-diazabicyclo[3.2.1]oct-3-yl](1H-1,2,3-triazol-4-yl)methanones US Patent US10167293 Publication Date 1/1/2019
 
Aldo-keto reductase family 1 member C3
Name:Aldo-keto reductase family 1 member C3
Type:Enzyme
Mol. Mass.:36859.86
Organism:Homo sapiens (Human)
Description:P42330
Residue:323
BDBM313878
NameBDBM313878
Synonyms:US10167293, Example 69
TypeSmall organic molecule
Emp. Form.C17H19N5O4S
Mol. Mass.389.429
SMILESO=C(N1CC2CCC(C1)N2S(=O)(=O)c1cccc2CCOc12)c1cnn[nH]1