Reaction Details
TargetAldo-keto reductase family 1 member C3
LigandBDBM313884
Substrate/Competitorn/a
Meas. Tech.AKR1C3-Inhibitory Activity Assay
IC50 0.700±n/a nM
Citation Koppitz, MSiebeneicher, HSteuber, HTer Laak, ANubbemeyer, RRottmann, AIrlbacher, HBader, BPeters, MWagenfeld, ATerebesi, I [8-(phenylsulfonyl)-3,8-diazabicyclo[3.2.1]oct-3-yl](1H-1,2,3-triazol-4-yl)methanones US Patent US10167293 Publication Date 1/1/2019
 
Aldo-keto reductase family 1 member C3
Name:Aldo-keto reductase family 1 member C3
Type:Enzyme
Mol. Mass.:36859.86
Organism:Homo sapiens (Human)
Description:P42330
Residue:323
BDBM313884
NameBDBM313884
Synonyms:US10167293, Example 75 | sodium 5-({8-[(3,5-difluorophenyl)sulfonyl]-3,8-diazabicyclo[3.2.1]oct-3-yl}carbonyl)-1,2,3-triazol-1-ide
TypeSmall organic molecule
Emp. Form.C15H14F2N5O3S
Mol. Mass.382.366
SMILESFc1cc(F)cc(c1)S(=O)(=O)N1C2CCC1CN(C2)C(=O)c1cnn[n-]1