Reaction Details
TargetAcetylcholinesterase
LigandBDBM10407
Substrate/CompetitorBDBM8959
Meas. Tech.Enzyme Inhibition Assay
IC50 70±n/a nM
Citation Mary, ARenko, DZGuillou, CThal, C Potent acetylcholinesterase inhibitors: design, synthesis, and structure-activity relationships of bis-interacting ligands in the galanthamine series. Bioorg Med Chem6:1835-50 (1998) 
 
Acetylcholinesterase
Name:Acetylcholinesterase
Type:n/a
Mol. Mass.:65900.74
Organism:Tetronarce californica (Pacific electric ray) (Torpedo californica)
Description:P04058
Residue:586
BDBM10407
BDBM8959
NameBDBM10407
Synonyms:(1S,12S,14R)-9-{[8-(1,3-dioxo-2,3-dihydro-1H-isoindol-2-yl)octyl]oxy}-14-hydroxy-4-methyl-11-oxa-4-azatetracyclo[8.6.1.0^{1,12}.0^{6,17}]heptadeca-4,6,8,10(17),15-pentaen-4-ium galanthamine deriv. 8d
TypeSmall organic molecule
Emp. Form.C32H37N2O5
Mol. Mass.529.646
SMILESC[N+]1=Cc2ccc(OCCCCCCCCN3C(=O)c4ccccc4C3=O)c3O[C@H]4C[C@@H](O)C=C[C@@]4(CC1)c23