Reaction Details
TargetMAP kinase-interacting serine/threonine-protein kinase 2
LigandBDBM313914
Substrate/Competitorn/a
Meas. Tech.MNK2a In Vitro Kinase Assay (Assay 1)
IC50 0.800±n/a nM
Citation Blum, A Sulfoximine substituted quinazolines for pharmaceutical compositions US Patent US10167296 Publication Date 1/1/2019
 
MAP kinase-interacting serine/threonine-protein kinase 2
Name:MAP kinase-interacting serine/threonine-protein kinase 2
Type:Protein
Mol. Mass.:51870.79
Organism:Homo sapiens (Human)
Description:Q9HBH9
Residue:465
BDBM313914
NameBDBM313914
Synonyms:US10167296, Example 2.25
TypeSmall organic molecule
Emp. Form.C24H27FN4O5S
Mol. Mass.502.558
SMILESCOc1c(C)c2c(Nc3ccc(F)cc3O[C@@H]3CO[C@@H]4CCO[C@H]34)ncnc2cc1N=S(C)(C)=O