Reaction Details
TargetcAMP and cAMP-inhibited cGMP 3',5'-cyclic phosphodiesterase 10A [440-779]
LigandBDBM164283
Substrate/Competitorn/a
Meas. Tech.PDE10A Inhibition Assay
Temperature298.15±n/a K
IC50 0.54±n/a nM
Commentsextracted
Citation Püschl, ANielsen, JKehler, JKilburn, JPMarigo, MLanggård, M Heteroaromatic phenylimidazole derivatives as PDE10A enzyme inhibitors US Patent US9669029 Publication Date 6/6/2017
 
cAMP and cAMP-inhibited cGMP 3',5'-cyclic phosphodiesterase 10A [440-779]
Name:cAMP and cAMP-inhibited cGMP 3',5'-cyclic phosphodiesterase 10A [440-779]
Type:n/a
Mol. Mass.:39060.01
Organism:Homo sapiens (Human)
Description:Q9Y233[440-779]
Residue:340
BDBM164283
NameBDBM164283
Synonyms:US9669029, 33 5-Methyl-2-[2-(4-thiophen-2-yl-1H-imidazol-2-yl)-ethyl]-[1,2,4]triazolo[1,5-a]pyridine
TypeSmall organic molecule
Emp. Form.C16H17N5S
Mol. Mass.311.405
SMILESCC1=CC=CC2NC(CCc3nc(c[nH]3)-c3cccs3)=NN12