Reaction Details
TargetCarboxylic ester hydrolase
LigandBDBM8963
Substrate/CompetitorBDBM8978
Meas. Tech.Measurement of FBSAChE/EqBuChE Inhibitory Activity
pH8±n/a
Temperature298.15±n/a K
Ki 2±n/a nM
Citation Savini, LCampiani, GGaeta, APellerano, CFattorusso, CChiasserini, LFedorko, JMSaxena, A Novel and potent tacrine-related hetero- and homobivalent ligands for acetylcholinesterase and butyrylcholinesterase. Bioorg Med Chem Lett11:1779-82 (2001) 
 
Carboxylic ester hydrolase
Name:Carboxylic ester hydrolase
Type:Protein
Mol. Mass.:68842.83
Organism:Equus caballus (Horse)
Description:Q9N1N9
Residue:602
BDBM8963
BDBM8978
NameBDBM8963
Synonyms:CHEMBL32823 N-[7-(1,2,3,4-tetrahydroacridin-9-ylamino)heptyl]-1,2,3,4-tetrahydroacridin-9-amine Tacrine-Based Inhibitor 2f | tacrine homobivalent compound 3a
TypeSmall organic molecule
Emp. Form.C33H40N4
Mol. Mass.492.6975
SMILESC(CCCNc1c2CCCCc2nc2ccccc12)CCCNc1c2CCCCc2nc2ccccc12