Reaction Details
TargetCarboxylic ester hydrolase
LigandBDBM8970
Substrate/CompetitorBDBM8978
Meas. Tech.Measurement of FBSAChE/EqBuChE Inhibitory Activity
pH8±n/a
Temperature298.15±n/a K
Ki 35±n/a nM
Citation Savini, LCampiani, GGaeta, APellerano, CFattorusso, CChiasserini, LFedorko, JMSaxena, A Novel and potent tacrine-related hetero- and homobivalent ligands for acetylcholinesterase and butyrylcholinesterase. Bioorg Med Chem Lett11:1779-82 (2001) 
 
Carboxylic ester hydrolase
Name:Carboxylic ester hydrolase
Type:Protein
Mol. Mass.:68842.83
Organism:Equus caballus (Horse)
Description:Q9N1N9
Residue:602
BDBM8970
BDBM8978
NameBDBM8970
Synonyms:CHEMBL51197 Tacrine Dimer 4f | tacrine heterobivalent compound 3e
TypeSmall organic molecule
Emp. Form.C33H39N3S
Mol. Mass.509.748
SMILESC(CCCNc1c2CCCCc2nc2ccccc12)CCCSc1c2CCCCc2nc2ccccc12