Reaction Details
TargetBDNF/NT-3 growth factors receptor
LigandBDBM164912
Substrate/Competitorn/a
Meas. Tech.TrkB Activity
IC50 0.600±n/a nM
Citation Kane, Jr., JLMatthews, GMetz, MKothe, MLiu, JScholte, A Tropomyosin-related kinase (TRK) inhibitors US Patent US9611265 Publication Date 4/4/2017
 
BDNF/NT-3 growth factors receptor
Name:BDNF/NT-3 growth factors receptor
Type:Enzyme
Mol. Mass.:91996.87
Organism:Homo sapiens (Human)
Description:Q16620
Residue:822
BDBM164912
NameBDBM164912
Synonyms:US10166239, Ex. 3-20 US9067914, Ex. 3-20
TypeSmall organic molecule
Emp. Form.C29H31N7O2
Mol. Mass.509.6021
SMILESCOc1cc(Cn2cnc3cc(cnc23)-c2cnn(c2)C2CCNCC2)ccc1OCc1ccc(C)nc1