Reaction Details
TargetCarbonic anhydrase 1
LigandBDBM10888
Substrate/Competitorn/a
Meas. Tech.Known Inhibitors of Carbonic Anhydrase
IC50 35.0±n/a nM
Citation Collier, GRWalder, KRCampbell, JAMolero-Navajas, JKonstantopoulos, NKrippner, GY Insulin sensitisers and methods of treatment US Patent US10172837 Publication Date 1/8/2019
 
Carbonic anhydrase 1
Name:Carbonic anhydrase 1
Type:Enzyme
Mol. Mass.:28873.37
Organism:Homo sapiens (Human)
Description:P00915
Residue:261
BDBM10888
NameBDBM10888
Synonyms:1,2-benzoxazol-3-ylmethanesulfonamide SPR_2 Zonisamide Zonisamide (ZNS) Zonisamide, ZNS
TypeSmall organic molecule
Emp. Form.C8H8N2O3S
Mol. Mass.212.226
SMILESNS(=O)(=O)Cc1noc2ccccc12