Reaction Details
TargetPhosphatidylinositol 3-kinase regulatory subunit beta
LigandBDBM315561
Substrate/Competitorn/a
Meas. Tech.In vitro kinase assay
IC50>500±n/a nM
Citation Liu, YRen, PJessen, KGuo, XRommel, C Combination pharmaceutical compositions and uses thereof US Patent US10172858 Publication Date 1/8/2019
 
Phosphatidylinositol 3-kinase regulatory subunit beta
Name:Phosphatidylinositol 3-kinase regulatory subunit beta
Type:Enzyme Subunit
Mol. Mass.:81542.75
Organism:Homo sapiens (Human)
Description:O00459
Residue:728
BDBM315561
NameBDBM315561
Synonyms:US10172858, Table 2.58 | US9828378, # 58
TypeSmall organic molecule
Emp. Form.C24H30N8O
Mol. Mass.446.548
SMILESCN1CCN(CC1)C1CCC(CC1)n1nc(-c2cc3cc(O)ccc3[nH]2)c2c(N)ncnc12