Reaction Details
TargetIsocitrate dehydrogenase [NADP], mitochondrial [R140Q]
LigandBDBM279884
Substrate/Competitorn/a
Meas. Tech.In Vitro Assays for IDH2m R140Q Inhibitors
IC50<50±n/a nM
Citation Konteatis, ZDPopovici-Muller, JTravins, JMZahler, RCai, ZZhou, D Therapeutically active compounds and their methods of use US Patent US10172864 Publication Date 1/8/2019
 
Isocitrate dehydrogenase [NADP], mitochondrial [R140Q]
Name:Isocitrate dehydrogenase [NADP], mitochondrial [R140Q]
Type:Enzyme Catalytic Domain
Mol. Mass.:50823.17
Organism:Homo sapiens (Human)
Description:P48735 (R140Q)
Residue:452
BDBM279884
NameBDBM279884
Synonyms:US10028961, Compound 31 US10946023, Compound 31
TypeSmall organic molecule
Emp. Form.C19H19F7N6
Mol. Mass.464.3832
SMILESFC(F)(F)c1cccc(n1)-c1nc(NC2CCC(F)(F)C2)nc(NC2CCC(F)(F)C2)n1