Reaction Details
TargetBeta-glucuronidase
LigandBDBM316366
Substrate/Competitorn/a
Meas. Tech. β-Glucuronidase Activity Assay
IC50<1±n/a nM
Citation Williams, ALScott, JYeh, LRedinbo, MR Phenoxy thiophene sulfonamides and their use as inhibitors of glucuronidase US Patent US9617239 Publication Date 4/11/2017
 
Beta-glucuronidase
Name:Beta-glucuronidase
Type:Protein
Mol. Mass.:74736.05
Organism:Homo sapiens (Human)
Description:n/a
Residue:651
BDBM316366
NameBDBM316366
Synonyms:US9617239, BRITE-354972
TypeSmall organic molecule
Emp. Form.C22H19NO3S2
Mol. Mass.409.521
SMILESCc1ccc(Oc2ccc(s2)S(=O)(=O)NCc2cccc3ccccc23)cc1