Reaction Details
TargetBeta-glucuronidase
LigandBDBM316376
Substrate/Competitorn/a
Meas. Tech. β-Glucuronidase Activity Assay
IC50 220±n/a nM
Citation Williams, ALScott, JYeh, LRedinbo, MR Phenoxy thiophene sulfonamides and their use as inhibitors of glucuronidase US Patent US9617239 Publication Date 4/11/2017
 
Beta-glucuronidase
Name:Beta-glucuronidase
Type:Protein
Mol. Mass.:74736.05
Organism:Homo sapiens (Human)
Description:n/a
Residue:651
BDBM316376
NameBDBM316376
Synonyms:US9617239, BRITE-355017
TypeSmall organic molecule
Emp. Form.C22H23N3O5S2
Mol. Mass.473.565
SMILESO=S(=O)(NCc1ccc2OCOc2c1)c1ccc(Oc2cccc(c2)N2CCNCC2)s1