Reaction Details
TargetBeta-glucuronidase
LigandBDBM316454
Substrate/Competitorn/a
Meas. Tech. β-Glucuronidase Activity Assay
IC50 90.0±n/a nM
Citation Williams, ALScott, JYeh, LRedinbo, MR Phenoxy thiophene sulfonamides and their use as inhibitors of glucuronidase US Patent US9617239 Publication Date 4/11/2017
 
Beta-glucuronidase
Name:Beta-glucuronidase
Type:Protein
Mol. Mass.:74736.05
Organism:Homo sapiens (Human)
Description:n/a
Residue:651
BDBM316454
NameBDBM316454
Synonyms:US9617239, BRITE-492797
TypeSmall organic molecule
Emp. Form.C25H25N3O3S2
Mol. Mass.479.614
SMILESO=S(=O)(NCc1cccc2ccccc12)c1ccc(Oc2cccc(c2)N2CCNCC2)s1