Reaction Details
TargetCarbonic anhydrase 1
LigandBDBM10881
Substrate/CompetitorBDBM10856
Meas. Tech.CA Inhibition Assay
Ki 50±n/a nM
Citation Nishimori, IMinakuchi, TMorimoto, KSano, SOnishi, STakeuchi, HVullo, DScozzafava, ASupuran, CT Carbonic anhydrase inhibitors: DNA cloning and inhibition studies of the alpha-carbonic anhydrase from Helicobacter pylori, a new target for developing sulfonamide and sulfamate gastric drugs. J Med Chem49:2117-26 (2006) 
 
Carbonic anhydrase 1
Name:Carbonic anhydrase 1
Type:Enzyme
Mol. Mass.:28873.37
Organism:Homo sapiens (Human)
Description:P00915
Residue:261
BDBM10881
BDBM10856
NameBDBM10881
Synonyms:CHEMBL288100 Methazolamide Methazolamide, MZA Sulfonamide, 2 sulfonamide 2
TypeSmall organic molecule
Emp. Form.C5H8N4O3S2
Mol. Mass.236.272
SMILESCC(=O)N=c1sc(nn1C)S(N)(=O)=O