Reaction Details
TargetCarbonic anhydrase 1
LigandBDBM10896
Substrate/CompetitorBDBM10856
Meas. Tech.CA Inhibition Assay
Ki 541±n/a nM
Citation Nishimori, IMinakuchi, TMorimoto, KSano, SOnishi, STakeuchi, HVullo, DScozzafava, ASupuran, CT Carbonic anhydrase inhibitors: DNA cloning and inhibition studies of the alpha-carbonic anhydrase from Helicobacter pylori, a new target for developing sulfonamide and sulfamate gastric drugs. J Med Chem49:2117-26 (2006) 
 
Carbonic anhydrase 1
Name:Carbonic anhydrase 1
Type:Enzyme
Mol. Mass.:28873.37
Organism:Homo sapiens (Human)
Description:P00915
Residue:261
BDBM10896
BDBM10856
NameBDBM10896
Synonyms:4-tert-butyl-N-(5-sulfamoyl-1,3,4-thiadiazol-2-yl)benzamide aromatic/heteroaromatic sulfonamide 30
TypeSmall organic molecule
Emp. Form.C13H16N4O3S2
Mol. Mass.340.421
SMILESCC(C)(C)c1ccc(cc1)C(=O)Nc1nnc(s1)S(N)(=O)=O