Reaction Details
TargetCarbonic anhydrase 2
LigandBDBM10869
Substrate/CompetitorBDBM10856
Meas. Tech.CA Inhibition Assay
Ki 19±n/a nM
Citation Nishimori, IMinakuchi, TMorimoto, KSano, SOnishi, STakeuchi, HVullo, DScozzafava, ASupuran, CT Carbonic anhydrase inhibitors: DNA cloning and inhibition studies of the alpha-carbonic anhydrase from Helicobacter pylori, a new target for developing sulfonamide and sulfamate gastric drugs. J Med Chem49:2117-26 (2006) 
 
Carbonic anhydrase 2
Name:Carbonic anhydrase 2
Type:Enzyme
Mol. Mass.:29250.71
Organism:Homo sapiens (Human)
Description:P00918
Residue:260
BDBM10869
BDBM10856
NameBDBM10869
Synonyms:5-imino-4-methyl-4,5-dihydro-1,3,4-thiadiazole-2-sulfonamide aromatic/heteroaromatic sulfonamide 14
TypeSmall organic molecule
Emp. Form.C3H6N4O2S2
Mol. Mass.194.235
SMILESCn1nc(sc1=N)S(N)(=O)=O