Reaction Details
TargetCARBONIC ANHYDRASE
LigandBDBM10869
Substrate/CompetitorBDBM10856
Meas. Tech.CA Inhibition Assay
Ki 549±n/a nM
Citation Nishimori, IMinakuchi, TMorimoto, KSano, SOnishi, STakeuchi, HVullo, DScozzafava, ASupuran, CT Carbonic anhydrase inhibitors: DNA cloning and inhibition studies of the alpha-carbonic anhydrase from Helicobacter pylori, a new target for developing sulfonamide and sulfamate gastric drugs. J Med Chem49:2117-26 (2006) 
 
CARBONIC ANHYDRASE
Name:CARBONIC ANHYDRASE
Type:Enzyme
Mol. Mass.:28277.52
Organism:Helicobacter pylori J99
Description:Q9ZK30
Residue:247
BDBM10869
BDBM10856
NameBDBM10869
Synonyms:5-imino-4-methyl-4,5-dihydro-1,3,4-thiadiazole-2-sulfonamide aromatic/heteroaromatic sulfonamide 14
TypeSmall organic molecule
Emp. Form.C3H6N4O2S2
Mol. Mass.194.235
SMILESCn1nc(sc1=N)S(N)(=O)=O