Reaction Details
TargetCARBONIC ANHYDRASE
LigandBDBM10898
Substrate/CompetitorBDBM10856
Meas. Tech.CA Inhibition Assay
Ki 318±n/a nM
Citation Nishimori, IMinakuchi, TMorimoto, KSano, SOnishi, STakeuchi, HVullo, DScozzafava, ASupuran, CT Carbonic anhydrase inhibitors: DNA cloning and inhibition studies of the alpha-carbonic anhydrase from Helicobacter pylori, a new target for developing sulfonamide and sulfamate gastric drugs. J Med Chem49:2117-26 (2006) 
 
CARBONIC ANHYDRASE
Name:CARBONIC ANHYDRASE
Type:Enzyme
Mol. Mass.:28277.52
Organism:Helicobacter pylori J99
Description:Q9ZK30
Residue:247
BDBM10898
BDBM10856
NameBDBM10898
Synonyms:1-N-(4-tert-butylbenzene)benzene-1,3-disulfonamide aromatic/heteroaromatic sulfonamide 32
TypeSmall organic molecule
Emp. Form.C16H20N2O4S2
Mol. Mass.368.471
SMILESCC(C)(C)c1ccc(cc1)S(=O)(=O)Nc1cccc(c1)S(N)(=O)=O