Reaction Details
TargetDual specificity protein kinase CLK2
LigandBDBM317460
Substrate/Competitorn/a
Meas. Tech.Radioactivity Based Kinase Assay
IC50 4.33±n/a nM
Citation Zhu, DBoylan, JXu, SRiggs, JShi, TWurmser, AMikolon, DDeyanat-Yazdi, G Methods of treating a cancer using substituted pyrrolopyrimidine compounds, compositions thereof US Patent US9623028 Publication Date 4/18/2017
 
Dual specificity protein kinase CLK2
Name:Dual specificity protein kinase CLK2
Type:n/a
Mol. Mass.:60128.79
Organism:Homo sapiens (Human)
Description:P49760
Residue:499
BDBM317460
NameBDBM317460
Synonyms:4-(5-(4-hydroxyphenyl)-4- (tetrahydro-2H-pyran-4-yloxy)- 7H-pyrrolo[2,3-d]pyrimidin-2- ylamino)-3-methoxy-N- methylbenzamide | US9623028, Compound 17
TypeSmall organic molecule
Emp. Form.C26H27N5O5
Mol. Mass.489.5231
SMILESCNC(=O)c1ccc(Nc2nc(OC3CCOCC3)c3c(c[nH]c3n2)-c2ccc(O)cc2)c(OC)c1