Reaction Details
TargetCyclin-dependent kinase 2/G1/S-specific cyclin-E1
LigandBDBM187124
Substrate/Competitorn/a
Meas. Tech.CDK2/CycE Kinase Assay
pH8±n/a
IC50 7±0.0 nM
Commentsextracted
Citation Lücking, UBöhnke, NScholz, ALienau, PSiemeister, GBömer, UKosemund, DBohlmann, RZorn, L 5-fluoro-N-(pyridin-2-yl)pyridin-2-amine derivatives containing a sulfone group US Patent US9670161 Publication Date 6/6/2017
 
Cyclin-dependent kinase 2/G1/S-specific cyclin-E1
Name:Cyclin-dependent kinase 2/G1/S-specific cyclin-E1
Type:Protein
Mol. Mass.:n/a
Description:n/a
Components:This complex has 2 components.
Component 1
Name:Cyclin-dependent kinase 2
Synonyms:CDK2 CDK2_HUMAN Cell division protein kinase 2 Protein cereblon/Cyclin-dependent kinase 2 | p33 protein kinase
Type:Enzyme Subunit
Mol. Mass.:33938.17
Organism:Homo sapiens (Human)
Description:P24941
Residue:298
Component 2
Name:G1/S-specific cyclin-E1
Synonyms:CCNE CCNE1_HUMAN
Type:Enzyme Subunit
Mol. Mass.:47073.17
Organism:Homo sapiens (Human)
Description:n/a
Residue:410
BDBM187124
NameBDBM187124
Synonyms:US9670161, 5 N-{6-(Difluoromethyl)-4-[(methylsulfonyl)methyl]pyridin-2-yl}-5-fluoro-4-(4-fluoro-2-methoxyphenyl)pyridin-2-amine
TypeSmall organic molecule
Emp. Form.C20H17F4N3O3S
Mol. Mass.455.426
SMILESCOc1cc(F)ccc1-c1cc(Nc2cc(CS(C)(=O)=O)cc(n2)C(F)F)ncc1F