Reaction Details
TargetIndoleamine 2,3-dioxygenase 1
LigandBDBM317558
Substrate/Competitorn/a
Meas. Tech.Biological Activity Assay
IC50 1.000±n/a nM
Citation Balog, JAHuang, AChen, BChen, LShan, W IDO inhibitors US Patent US9624188 Publication Date 4/18/2017
 
Indoleamine 2,3-dioxygenase 1
Name:Indoleamine 2,3-dioxygenase 1
Type:Enzyme
Mol. Mass.:45330.80
Organism:Homo sapiens (Human)
Description:P14902
Residue:403
BDBM317558
NameBDBM317558
Synonyms:US9624188, 49 | racemic
TypeSmall organic molecule
Emp. Form.C28H39N3O3
Mol. Mass.465.6276
SMILESCC(C)CN(C1CCCCC1)c1ccc(cc1NC(=O)Nc1ccc(C)cc1)C(C)CC(O)=O