Reaction Details
TargetAmine oxidase
LigandBDBM11020
Substrate/CompetitorBDBM11019
Meas. Tech.MAO Inhibition Assay
pH7.4±n/a
Temperature298.15±n/a K
Ki>1000000±n/a nM
Commentsno inhibition
Citation Hubalek, FBinda, CKhalil, ALi, MMattevi, ACastagnoli, NEdmondson, DE Demonstration of isoleucine 199 as a structural determinant for the selective inhibition of human monoamine oxidase B by specific reversible inhibitors. J Biol Chem280:15761-6 (2005) 
 
Amine oxidase
Name:Amine oxidase
Type:Enzyme
Mol. Mass.:50985.83
Organism:Ovis aries (sheep)
Description:Mitochondrial preparation.
Residue:451
BDBM11020
BDBM11019
NameBDBM11020
Synonyms:1,4-diphenyl-2-butene (DPB) | [(2E)-4-phenylbut-2-en-1-yl]benzene
TypeSmall organic molecule
Emp. Form.C16H16
Mol. Mass.208.2982
SMILESC(\C=C\Cc1ccccc1)c1ccccc1