Reaction Details
TargetAmine oxidase [flavin-containing] B [I199F]
LigandBDBM11022
Substrate/CompetitorBDBM10999
Meas. Tech.MAO Inhibition Assay
Ki 500±n/a nM
Citation Hubalek, FBinda, CKhalil, ALi, MMattevi, ACastagnoli, NEdmondson, DE Demonstration of isoleucine 199 as a structural determinant for the selective inhibition of human monoamine oxidase B by specific reversible inhibitors. J Biol Chem280:15761-6 (2005) 
 
Amine oxidase [flavin-containing] B [I199F]
Name:Amine oxidase [flavin-containing] B [I199F]
Type:Enzyme
Mol. Mass.:58802.78
Organism:Homo sapiens (Human)
Description:Human recombinant MAO B were expressed and purified from Pichia pastoris.
Residue:520
BDBM11022
BDBM10999
NameBDBM11022
Synonyms:2,3-dihydro-1H-indole-2,3-dione Isatin | Isatin (Compound 1)
TypeSmall organic molecule
Emp. Form.C8H5NO2
Mol. Mass.147.1308
SMILESO=C1Nc2ccccc2C1=O