Reaction Details
TargetCarbonic anhydrase 5A, mitochondrial
LigandBDBM10889
Substrate/CompetitorBDBM10856
Meas. Tech.CA Inhibition Assay
Ki 174±n/a nM
Citation Nishimori, IVullo, DInnocenti, AScozzafava, AMastrolorenzo, ASupuran, CT Carbonic anhydrase inhibitors. The mitochondrial isozyme VB as a new target for sulfonamide and sulfamate inhibitors. J Med Chem48:7860-6 (2005) 
 
Carbonic anhydrase 5A, mitochondrial
Name:Carbonic anhydrase 5A, mitochondrial
Type:Enzyme
Mol. Mass.:34755.54
Organism:Homo sapiens (Human)
Description:Human (cloned) isozyme
Residue:305
BDBM10889
BDBM10856
NameBDBM10889
Synonyms:2-methoxy-N-[(1-methylpyrrolidin-2-yl)methyl]-5-sulfamoylbenzamide Sulpiride (SLP)
TypeSmall organic molecule
Emp. Form.C14H21N3O4S
Mol. Mass.327.399
SMILESCOc1ccc(cc1C(=O)NCC1CCCN1C)S(N)(=O)=O