Reaction Details
TargetCarbonic anhydrase 5B, mitochondrial
LigandBDBM10858
Substrate/CompetitorBDBM10856
Meas. Tech.CA Inhibition Assay
Ki 3500±n/a nM
Citation Nishimori, IVullo, DInnocenti, AScozzafava, AMastrolorenzo, ASupuran, CT Carbonic anhydrase inhibitors. The mitochondrial isozyme VB as a new target for sulfonamide and sulfamate inhibitors. J Med Chem48:7860-6 (2005) 
 
Carbonic anhydrase 5B, mitochondrial
Name:Carbonic anhydrase 5B, mitochondrial
Type:Enzyme
Mol. Mass.:36440.83
Organism:Homo sapiens (Human)
Description:Human (cloned) isozyme
Residue:317
BDBM10858
BDBM10856
NameBDBM10858
Synonyms:4-hydrazinylbenzene-1-sulfonamide aromatic/heteroaromatic sulfonamide 3 | hydrazide deriv. 14
TypeSmall organic molecule
Emp. Form.C6H9N3O2S
Mol. Mass.187.22
SMILESNNc1ccc(cc1)S(N)(=O)=O