Reaction Details
TargetCarbonic anhydrase 5B, mitochondrial
LigandBDBM10872
Substrate/CompetitorBDBM10856
Meas. Tech.CA Inhibition Assay
Ki 42±n/a nM
Citation Nishimori, IVullo, DInnocenti, AScozzafava, AMastrolorenzo, ASupuran, CT Carbonic anhydrase inhibitors. The mitochondrial isozyme VB as a new target for sulfonamide and sulfamate inhibitors. J Med Chem48:7860-6 (2005) 
 
Carbonic anhydrase 5B, mitochondrial
Name:Carbonic anhydrase 5B, mitochondrial
Type:Enzyme
Mol. Mass.:36440.83
Organism:Homo sapiens (Human)
Description:Human (cloned) isozyme
Residue:317
BDBM10872
BDBM10856
NameBDBM10872
Synonyms:4-amino-N-[2-(4-sulfamoylphenyl)ethyl]benzene-1-sulfonamide aromatic/heteroaromatic sulfonamide 17
TypeSmall organic molecule
Emp. Form.C14H17N3O4S2
Mol. Mass.355.432
SMILESNc1ccc(cc1)S(=O)(=O)NCCc1ccc(cc1)S(N)(=O)=O