Reaction Details
TargetPoly [ADP-ribose] polymerase tankyrase-1
LigandBDBM318040
Substrate/Competitorn/a
Meas. Tech.Biochemical Assay
IC50 14.5±10.7 nM
Citation Chedid, MEissa, HOEngler, TAFurness, KWRank, KBWoods, TAWrobleski, AD Pyrido[2,3-d]pyrimidin-4-one compounds as tankyrase inhibitors US Patent US9624218 Publication Date 4/18/2017
 
Poly [ADP-ribose] polymerase tankyrase-1
Name:Poly [ADP-ribose] polymerase tankyrase-1
Type:Enzyme
Mol. Mass.:142058.03
Organism:Homo sapiens (Human)
Description:O95271
Residue:1327
BDBM318040
NameBDBM318040
Synonyms:2-[4-[(4-Chloropyrimidin-2-yl)methyl]piperazin-1-yl]-8-methyl-3,5,6,7-tetrahydropyrido[2,3-d]pyrimidin-4-one | US9624218, Example 41
TypeSmall organic molecule
Emp. Form.C17H22ClN7O
Mol. Mass.375.856
SMILESCN1CCCc2c1nc([nH]c2=O)N1CCN(Cc2nccc(Cl)n2)CC1