Reaction Details
TargetPoly [ADP-ribose] polymerase tankyrase-2
LigandBDBM318043
Substrate/Competitorn/a
Meas. Tech.Biochemical Assay
IC50 12.7±2.49 nM
Citation Chedid, MEissa, HOEngler, TAFurness, KWRank, KBWoods, TAWrobleski, AD Pyrido[2,3-d]pyrimidin-4-one compounds as tankyrase inhibitors US Patent US9624218 Publication Date 4/18/2017
 
Poly [ADP-ribose] polymerase tankyrase-2
Name:Poly [ADP-ribose] polymerase tankyrase-2
Type:Enzyme
Mol. Mass.:126937.16
Organism:Homo sapiens (Human)
Description:Q9H2K2
Residue:1166
BDBM318043
NameBDBM318043
Synonyms:8-Methyl-2-[4-[(3-methyl- pyrazin-2-yl)methyl]piperazin- 1-yl]-3,5,6,7- tetrahydropyrido[2,3- d]pyrimidin-4-one | US9624218, Example 44
TypeSmall organic molecule
Emp. Form.C18H25N7O
Mol. Mass.355.4374
SMILESCN1CCCc2c1nc([nH]c2=O)N1CCN(Cc2nccnc2C)CC1