Reaction Details
TargetCarbonic anhydrase 1
LigandBDBM11033
Substrate/CompetitorBDBM10856
Meas. Tech.CA Inhibition Assay
pH7.5±n/a
Temperature295.15±n/a K
Ki 3560±n/a nM
Citation Thiry, ALedecq, MCecchi, ADogne, JMWouters, JSupuran, CTMasereel, B Indanesulfonamides as carbonic anhydrase inhibitors. Toward structure-based design of selective inhibitors of the tumor-associated isozyme CA IX. J Med Chem49:2743-9 (2006) 
 
Carbonic anhydrase 1
Name:Carbonic anhydrase 1
Type:Enzyme
Mol. Mass.:28873.37
Organism:Homo sapiens (Human)
Description:P00915
Residue:261
BDBM11033
BDBM10856
NameBDBM11033
Synonyms:2-cyclohexylamido-5-sulfonamidoindane Indanesulfonamide Derivative 12b | N-(5-sulfamoyl-2,3-dihydro-1H-inden-2-yl)cyclohexanecarboxamide
TypeSmall organic molecule
Emp. Form.C16H22N2O3S
Mol. Mass.322.422
SMILESNS(=O)(=O)c1ccc2CC(Cc2c1)NC(=O)C1CCCCC1