Reaction Details
TargetCarbonic anhydrase 2
LigandBDBM11030
Substrate/CompetitorBDBM10856
Meas. Tech.CA Inhibition Assay
Ki 1.2±n/a nM
Citation Thiry, ALedecq, MCecchi, ADogne, JMWouters, JSupuran, CTMasereel, B Indanesulfonamides as carbonic anhydrase inhibitors. Toward structure-based design of selective inhibitors of the tumor-associated isozyme CA IX. J Med Chem49:2743-9 (2006) 
 
Carbonic anhydrase 2
Name:Carbonic anhydrase 2
Type:Enzyme
Mol. Mass.:29250.71
Organism:Homo sapiens (Human)
Description:P00918
Residue:260
BDBM11030
BDBM10856
NameBDBM11030
Synonyms:1-valproylamido-5-sulfonamidoindane CHEMBL204941 | Indanesulfonamide Derivative 11a
TypeSmall organic molecule
Emp. Form.C17H26N2O3S
Mol. Mass.338.465
SMILESCCCC(CCC)C(=O)NC1CCc2cc(ccc12)S(N)(=O)=O