Reaction Details
TargetCarbonic anhydrase 9
LigandBDBM11033
Substrate/CompetitorBDBM10856
Meas. Tech.CA Inhibition Assay
Ki 30±n/a nM
Citation Thiry, ALedecq, MCecchi, ADogne, JMWouters, JSupuran, CTMasereel, B Indanesulfonamides as carbonic anhydrase inhibitors. Toward structure-based design of selective inhibitors of the tumor-associated isozyme CA IX. J Med Chem49:2743-9 (2006) 
 
Carbonic anhydrase 9
Name:Carbonic anhydrase 9
Type:Enzyme
Mol. Mass.:49669.03
Organism:Homo sapiens (Human)
Description:Catalytic domain of human cloned isozyme was used in the assay
Residue:459
BDBM11033
BDBM10856
NameBDBM11033
Synonyms:2-cyclohexylamido-5-sulfonamidoindane Indanesulfonamide Derivative 12b | N-(5-sulfamoyl-2,3-dihydro-1H-inden-2-yl)cyclohexanecarboxamide
TypeSmall organic molecule
Emp. Form.C16H22N2O3S
Mol. Mass.322.422
SMILESNS(=O)(=O)c1ccc2CC(Cc2c1)NC(=O)C1CCCCC1