Reaction Details
TargetBromodomain-containing protein 4
LigandBDBM318840
Substrate/Competitorn/a
Meas. Tech.In-Vitro Binding Assay
IC50<11.0±n/a nM
Citation Blank, JBold, GCotesta, SGuagnano, VRueeger, H Pyrazolo-pyrrolidin-4-one derivatives as bet inhibitors and their use in the treatment of disease US Patent US9624247 Publication Date 4/18/2017
 
Bromodomain-containing protein 4
Name:Bromodomain-containing protein 4
Type:Protein
Mol. Mass.:152264.84
Organism:Homo sapiens (Human)
Description:O60885
Residue:1362
BDBM318840
NameBDBM318840
Synonyms:(R)-6-4-chlorophenyl)-3-cyclopropyl-5-(3,8-dimethyl-[1,2,4]triazolo[4,3-a]pyridin-6-yl)-1-methyl-5,6-dihydropyrrolo[3,4-c]pyrazol-4(1H)-one | US9624247, Example 2
TypeSmall organic molecule
Emp. Form.C23H23ClN6O
Mol. Mass.434.921
SMILESCNC1=C(C(=N)C2CC2)C(=O)N([C@@H]1c1ccc(Cl)cc1)c1cc(C)c2nnc(C)n2c1