Reaction Details
TargetCell division cycle 7-related protein kinase [58-574]/Protein DBF4 homolog A
LigandBDBM50329427
Substrate/Competitorn/a
Meas. Tech.Inhibition Assay of Cdc7 Activity
IC50<100±n/a nM
Citation Vanotti, ECaldarelli, MCirla, AForte, BErmoli, AMenichincheri, MPillan, AScolaro, A Pyridyl-and pyrimidinyl-substituted pyrrole-, thiophene- and furane-derivatives as kinase inhibitors US Patent US9670191 Publication Date 6/6/2017
 
Cell division cycle 7-related protein kinase [58-574]/Protein DBF4 homolog A
Name:Cell division cycle 7-related protein kinase [58-574]/Protein DBF4 homolog A
Type:Protein Complex
Mol. Mass.:n/a
Description:n/a
Components:This complex has 2 components.
Component 1
Name:Cell division cycle 7-related protein kinase [58-574]
Synonyms:CDC7 CDC7_HUMAN Cell division cycle 7-related protein kinase
Type:Serine/threonine-protein kinase
Mol. Mass.:57470.88
Organism:Homo sapiens (Human)
Description:O00311[58-574]
Residue:517
Component 2
Name:Protein DBF4 homolog A
Synonyms:ASK Chiffon homolog A DBF4-type zinc finger-containing protein 1 DBF4A_HUMAN ZDBF1
Type:Regulatory subunit
Mol. Mass.:76869.65
Organism:Homo sapiens (Human)
Description:n/a
Residue:674
BDBM50329427
NameBDBM50329427
Synonyms:5-(2-Amino-pyrimidin-4-yl)-2-phenyl-1H-pyrrole-3-carboxamide US9670191, U1
TypeSmall organic molecule
Emp. Form.C15H13N5O
Mol. Mass.279.2966
SMILESNC(=O)c1cc([nH]c1-c1ccccc1)-c1ccnc(N)n1