Reaction Details
TargetNADPH oxidase 4
LigandBDBM318939
Substrate/Competitorn/a
Meas. Tech.Nox4 Assay
IC50 1680±n/a nM
Citation Wikström, PWalum, EWilcke, M N2-(3,4-dimethylphenyl)-6-((4-(p-tolyl)piperazin-1-yl)methyl)-1,3,5-triazine-2,4-diamine US Patent US10173988 Publication Date 1/8/2019
 
NADPH oxidase 4
Name:NADPH oxidase 4
Type:PROTEIN
Mol. Mass.:66954.54
Organism:Homo sapiens (Human)
Description:ChEMBL_792879
Residue:578
BDBM318939
NameBDBM318939
Synonyms:US10173988, Compound D
TypeSmall organic molecule
Emp. Form.C22H26ClN7
Mol. Mass.423.942
SMILESCc1ccc(Nc2nc(N)nc(CN3CCN(CC3)c3ccc(Cl)cc3)n2)cc1C