Reaction Details
TargetP2X purinoceptor 2
LigandBDBM319834
Substrate/Competitorn/a
Meas. Tech.Intracellular Calcium Measurement to Assess Antagonist Activity at Human P2X3 and Human P2X2/3 Receptors
IC50 76.0±n/a nM
Citation Davenport, AJBräuer, NFischer, OMRotgeri, ARottmann, ANeagoe, INagel, JGodinho-Coelho, AKlar, J 1,3-thiazol-2-yl substituted benzamides US Patent US10174016 Publication Date 1/8/2019
 
P2X purinoceptor 2
Name:P2X purinoceptor 2
Type:Enzyme Catalytic Domain
Mol. Mass.:51765.18
Organism:Homo sapiens (Human)
Description:PurinergicP2X2/3 0 HUMAN::Q9UBL9
Residue:471
BDBM319834
NameBDBM319834
Synonyms:3-(Cyclopropylmethoxy)-5-(5-methyl-1,3-thiazol-2-yl)-N-{(1R)-1-[2-(trifluoromethyl)pyrimidin-5-yl]ethyl}benzamide US10202369, Example 1 | US10472354, Example 1
TypeSmall organic molecule
Emp. Form.C22H21F3N4O2S
Mol. Mass.462.488
SMILESC[C@@H](NC(=O)c1cc(OCC2CC2)cc(c1)-c1ncc(C)s1)c1cnc(nc1)C(F)(F)F