Reaction Details
TargetP2X purinoceptor 2
LigandBDBM319936
Substrate/Competitorn/a
Meas. Tech.Intracellular Calcium Measurement to Assess Antagonist Activity at Human P2X3 and Human P2X2/3 Receptors
IC50 14.0±n/a nM
Citation Davenport, AJBräuer, NFischer, OMRotgeri, ARottmann, ANeagoe, INagel, JGodinho-Coelho, AKlar, J 1,3-thiazol-2-yl substituted benzamides US Patent US10174016 Publication Date 1/8/2019
 
P2X purinoceptor 2
Name:P2X purinoceptor 2
Type:Enzyme Catalytic Domain
Mol. Mass.:51765.18
Organism:Homo sapiens (Human)
Description:PurinergicP2X2/3 0 HUMAN::Q9UBL9
Residue:471
BDBM319936
NameBDBM319936
Synonyms:3-[(2- Methylpyridin- 4-yl)oxy]-5- (5-methyl- 1,3-thiazol-2- yl)-N-{(1R)-1- [2- (trifluorometh- yl)pyrimidin- 5- yl]ethyl} benzamide US10202369, Example 103 | US10472354, Example 103
TypeSmall organic molecule
Emp. Form.C24H20F3N5O2S
Mol. Mass.499.508
SMILESC[C@@H](NC(=O)c1cc(Oc2ccnc(C)c2)cc(c1)-c1ncc(C)s1)c1cnc(nc1)C(F)(F)F