Reaction Details
TargetPoly [ADP-ribose] polymerase 1
LigandBDBM320267
Substrate/Competitorn/a
Meas. Tech.HT Universal Chemiluminescent PARP Assay Kit
IC50 1.000±n/a nM
Citation Fan, XQin, J Heterocyclic-imidazole compounds, pharmaceutical compositions thereof, preparation method therefor and use thereof US Patent US10174023 Publication Date 1/8/2019
 
Poly [ADP-ribose] polymerase 1
Name:Poly [ADP-ribose] polymerase 1
Type:n/a
Mol. Mass.:113114.22
Organism:Homo sapiens (Human)
Description:P09874
Residue:1014
BDBM320267
NameBDBM320267
Synonyms:4-(4-fluoro-3-(4-(2-oxo-2,3-dihydro-1H-imidazo[4,5-b]pyridin-5-yl)piperazine-1-carbonyl) benzyl)phthalazin-1(2H)-one | US10174023, Compound (5)
TypeSmall organic molecule
Emp. Form.C26H22FN7O3
Mol. Mass.499.4964
SMILESFc1ccc(Cc2n[nH]c(=O)c3ccccc23)cc1C(=O)N1CCN(CC1)c1ccc2[nH]c(=O)[nH]c2n1